[models] implement solve()/output()/error_estimate() in terms of compute()

43 jobs for compute in 45 minutes and 10 seconds (queued for 4 seconds)
Status Job ID Name Coverage
  Sanity
passed #429879
ci setup

00:00:26

passed #429878
verify setup.py

00:00:19

 
  Test
passed #429880
long execution time
minimal_cpp_demo

00:03:28

passed #429881
long execution time
mpi 3 6

00:31:21

passed #429882
long execution time
mpi 3 7

00:27:10

passed #429883
long execution time
mpi 3 8

00:31:20

passed #429884
long execution time
notebooks_dir 3 6

00:12:40

passed #429885
long execution time
notebooks_dir 3 7

00:09:33

passed #429886
long execution time
notebooks_dir 3 8

00:12:25

passed #429893
long execution time
numpy_git 3 8

00:29:24

passed #429894
long execution time
oldest 3 6

00:27:54

passed #429887
long execution time
pip_installed 3 6

00:27:09

passed #429888
long execution time
pip_installed 3 7

00:27:07

passed #429889
long execution time
pip_installed 3 8

00:28:05

passed #429890
long execution time
vanilla 3 6

00:27:09

passed #429891
long execution time
vanilla 3 7

00:22:37

passed #429892
long execution time
vanilla 3 8

00:27:15

 
  Build
failed #429904
mike
docs build

00:07:56

passed #429895
amm-old-ci
wheel 1 py3 6

00:08:57

passed #429898
amm-old-ci
wheel 1 py3 7

00:09:02

passed #429901
amm-old-ci
wheel 1 py3 8

00:09:00

passed #429896
docker-in-docker
wheel 2010 py3 6

00:03:00

passed #429899
docker-in-docker
wheel 2010 py3 7

00:07:33

passed #429902
docker-in-docker
wheel 2010 py3 8

00:07:34

passed #429897
docker-in-docker
wheel 2014 py3 6

00:07:36

passed #429900
docker-in-docker
wheel 2014 py3 7

00:07:31

passed #429903
docker-in-docker
wheel 2014 py3 8

00:02:54

 
  Install Checks
passed #429910
mike
check_wheel 1

00:04:18

passed #429911
mike
check_wheel 2

00:04:03

passed #429912
mike
check_wheel 3

00:04:01

passed #429909
docker-in-docker
local_jupyter

00:04:14

skipped #429905
mike
pip 1/3
skipped #429906
mike
pip 2/3
skipped #429907
mike
pip 3/3
passed #429908
docker-in-docker
repo2docker

00:04:10

 
  Deploy
skipped #429919
mike
docs
skipped #429918
pypi deploy
passed #429916
submit numpy_git 3 8

00:00:14

passed #429917
submit oldest 3 6

00:00:15

passed #429913
submit vanilla 3 6

00:00:41

passed #429923
submit vanilla 3 7

00:00:14

passed #429915
submit vanilla 3 8

00:00:14

failed #429914
submit vanilla 3 7

00:02:19

 
Name Stage Failure
failed
docs build Build
AttributeError                            Traceback (most recent call last)
<ipython-input-7-85dc043ffd7c> in <module>
----> 1 print_source(fom._solve)

AttributeError: 'StationaryModel' object has no attribute '_solve'
make[1]: *** [Makefile:49: html] Error 2
make[1]: Leaving directory '/builds/pymor/pymor/docs'
make: *** [Makefile:78: docs] Error 2
ERROR: Job failed: exit code 1